Target
Amine oxidase [flavin-containing] A
Ligand
BDBM50005270
Substrate
Meas. Tech.
ChEMBL_543072 (CHEMBL1022171)
Ki
220±n/a nM
Citation
 Vilches-Herrera, MMiranda-Sepúlveda, JRebolledo-Fuentes, MFierro, ALühr, SIturriaga-Vasquez, PCassels, BKReyes-Parada, M Naphthylisopropylamine and N-benzylamphetamine derivatives as monoamine oxidase inhibitors. Bioorg Med Chem 17:2452-60 (2009)  
Target
Name:
Amine oxidase [flavin-containing] A
Synonyms:
AOFA_RAT Amine oxidase [flavin-containing] A Monoamine Oxidase Type A (MAO-A) Monoamine oxidase A (MAO-A) Monoamine oxidase type A (MAOA)
Type:
Enzyme
Mol. Mass.:
59515.21
Organism:
Rattus norvegicus (rat)
Description:
Residue:
526
  
Inhibitor
Name:
BDBM50005270
Synonyms:
1-(4-ethoxyphenyl)propan-2-amine CHEMBL161985
Type:
Small organic molecule
Emp. Form.:
C11H17NO
Mol. Mass.:
179.2588
SMILES:
CCOc1ccc(CC(C)N)cc1
: