Target
Amine oxidase [flavin-containing] A
Ligand
BDBM50276773
Substrate
Meas. Tech.
ChEMBL_543072 (CHEMBL1022171)
Ki
130±n/a nM
Citation
 Vilches-Herrera, MMiranda-Sepúlveda, JRebolledo-Fuentes, MFierro, ALühr, SIturriaga-Vasquez, PCassels, BKReyes-Parada, M Naphthylisopropylamine and N-benzylamphetamine derivatives as monoamine oxidase inhibitors. Bioorg Med Chem 17:2452-60 (2009)  
Target
Name:
Amine oxidase [flavin-containing] A
Synonyms:
AOFA_RAT Amine oxidase [flavin-containing] A Monoamine Oxidase Type A (MAO-A) Monoamine oxidase A (MAO-A) Monoamine oxidase type A (MAOA)
Type:
Enzyme
Mol. Mass.:
59515.21
Organism:
Rattus norvegicus (rat)
Description:
Residue:
526
  
Inhibitor
Name:
BDBM50276773
Synonyms:
1-(4-propoxyphenyl)propan-2-amine | CHEMBL455991
Type:
Small organic molecule
Emp. Form.:
C12H19NO
Mol. Mass.:
193.2854
SMILES:
CCCOc1ccc(CC(C)N)cc1
: