Target
Carbonic anhydrase 12
Ligand
BDBM10881
Substrate
Meas. Tech.
ChEMBL_565863 (CHEMBL959286)
Ki
3.4±n/a nM
Citation
 Crocetti, LMaresca, ATemperini, CHall, RAScozzafava, AMühlschlegel, FASupuran, CT A thiabendazole sulfonamide shows potent inhibitory activity against mammalian and nematode alpha-carbonic anhydrases. Bioorg Med Chem Lett 19:1371-5 (2009)  
Target
Name:
Carbonic anhydrase 12
Synonyms:
CA-XII CAH12_HUMAN Carbonic anhydrase Carbonic anhydrase XII Carbonic anhydrase XII (CAXII) | Tumor antigen HOM-RCC-3.1.3
Type:
Enzyme
Mol. Mass.:
39456.00
Organism:
Homo sapiens (Human)
Description:
Catalytic domain of human cloned isozyme was used in the assay
Residue:
354
  
Inhibitor
Name:
BDBM10881
Synonyms:
CHEMBL288100 Methazolamide Methazolamide, MZA Sulfonamide, 2 sulfonamide 2
Type:
Small organic molecule
Emp. Form.:
C5H8N4O3S2
Mol. Mass.:
236.272
SMILES:
CC(=O)N=c1sc(nn1C)S(N)(=O)=O
: