Target
Carbonic anhydrase 12
Ligand
BDBM25904
Substrate
Meas. Tech.
ChEMBL_565863 (CHEMBL959286)
Ki
110±n/a nM
Citation
 Crocetti, LMaresca, ATemperini, CHall, RAScozzafava, AMühlschlegel, FASupuran, CT A thiabendazole sulfonamide shows potent inhibitory activity against mammalian and nematode alpha-carbonic anhydrases. Bioorg Med Chem Lett 19:1371-5 (2009)  
Target
Name:
Carbonic anhydrase 12
Synonyms:
CA-XII CAH12_HUMAN Carbonic anhydrase Carbonic anhydrase XII Carbonic anhydrase XII (CAXII) | Tumor antigen HOM-RCC-3.1.3
Type:
Enzyme
Mol. Mass.:
39456.00
Organism:
Homo sapiens (Human)
Description:
Catalytic domain of human cloned isozyme was used in the assay
Residue:
354
  
Inhibitor
Name:
BDBM25904
Synonyms:
2-(hydrazinecarbonyl)-3-phenyl-1H-indole-5-sulfonamide CHEMBL262628 | indole sulfonamide, L
Type:
Small organic molecule
Emp. Form.:
C15H14N4O3S
Mol. Mass.:
330.362
SMILES:
NNC(=O)c1[nH]c2ccc(cc2c1-c1ccccc1)S(N)(=O)=O
: