Target
Carbonic anhydrase 9
Ligand
BDBM50278847
Substrate
Meas. Tech.
ChEMBL_501259 (CHEMBL976161)
Ki
6.1±n/a nM
Citation
 Singer, MLopez, MBornaghi, LFInnocenti, AVullo, DSupuran, CTPoulsen, SA Inhibition of carbonic anhydrase isozymes with benzene sulfonamides incorporating thio, sulfinyl and sulfonyl glycoside moieties. Bioorg Med Chem Lett 19:2273-6 (2009)  
Target
Name:
Carbonic anhydrase 9
Synonyms:
CA-IX CAH9_HUMAN Carbonic anhydrase 9 (CA IX) Carbonic anhydrase 9 precursor Carbonic anhydrase IX (CAIX) Carbonic anhydrases; II & IX MN RCC-associated antigen G250
Type:
Enzyme
Mol. Mass.:
49669.03
Organism:
Homo sapiens (Human)
Description:
Catalytic domain of human cloned isozyme was used in the assay
Residue:
459
  
Inhibitor
Name:
BDBM50278847
Synonyms:
4-(4-{[beta-D-galactopyranosyl]thiomethyl}-1-H-1,2,3-triazol-1-yl)benzenesulfonamide | CHEMBL498758
Type:
Small organic molecule
Emp. Form.:
C15H20N4O7S2
Mol. Mass.:
432.472
SMILES:
NS(=O)(=O)c1ccc(cc1)-n1cc(CS[C@@H]2O[C@H](CO)[C@H](O)[C@H](O)[C@H]2O)nn1
: