Target
Carbonic anhydrase 2
Ligand
BDBM50278845
Substrate
Meas. Tech.
ChEMBL_501258 (CHEMBL976160)
Ki
7.8±n/a nM
Citation
 Singer, MLopez, MBornaghi, LFInnocenti, AVullo, DSupuran, CTPoulsen, SA Inhibition of carbonic anhydrase isozymes with benzene sulfonamides incorporating thio, sulfinyl and sulfonyl glycoside moieties. Bioorg Med Chem Lett 19:2273-6 (2009)  
Target
Name:
Carbonic anhydrase 2
Synonyms:
CA-II CAC Carbonate dehydratase II Carbonic anhydrase 2 (CA-II) Carbonic anhydrase C Carbonic anhydrase II (CA-II) Carbonic anhydrase II (hCA II) | Carbonic anhydrase isoenzyme II (hCA II)
Type:
Enzyme
Mol. Mass.:
29250.71
Organism:
Homo sapiens (Human)
Description:
P00918
Residue:
260
  
Inhibitor
Name:
BDBM50278845
Synonyms:
4-(4-{[beta-D-glucopyranosyl]sulfinylmethyl}-1-H-1,2,3-triazol-1-yl)benzenesulfonamide | CHEMBL525195
Type:
Small organic molecule
Emp. Form.:
C15H20N4O8S2
Mol. Mass.:
448.471
SMILES:
NS(=O)(=O)c1ccc(cc1)-n1cc(CS(=O)[C@@H]2O[C@H](CO)[C@@H](O)[C@H](O)[C@H]2O)nn1
: