Target
Carbonic anhydrase 9
Ligand
BDBM50278779
Substrate
Meas. Tech.
ChEMBL_501259 (CHEMBL976161)
Ki
9.9±n/a nM
Citation
 Singer, MLopez, MBornaghi, LFInnocenti, AVullo, DSupuran, CTPoulsen, SA Inhibition of carbonic anhydrase isozymes with benzene sulfonamides incorporating thio, sulfinyl and sulfonyl glycoside moieties. Bioorg Med Chem Lett 19:2273-6 (2009)  
Target
Name:
Carbonic anhydrase 9
Synonyms:
CA-IX CAH9_HUMAN Carbonic anhydrase 9 (CA IX) Carbonic anhydrase 9 precursor Carbonic anhydrase IX (CAIX) Carbonic anhydrases; II & IX MN RCC-associated antigen G250
Type:
Enzyme
Mol. Mass.:
49669.03
Organism:
Homo sapiens (Human)
Description:
Catalytic domain of human cloned isozyme was used in the assay
Residue:
459
  
Inhibitor
Name:
BDBM50278779
Synonyms:
4-(4-{[2',3',4',6'-Tetra-O-acetyl-beta-D-glucopyranosyl]sulfinylmethyl}-1-H-1,2,3-triazol-1-yl)benzenesulfonamide | CHEMBL480302
Type:
Small organic molecule
Emp. Form.:
C23H28N4O12S2
Mol. Mass.:
616.618
SMILES:
CC(=O)OC[C@H]1O[C@H]([C@H](OC(C)=O)[C@@H](OC(C)=O)[C@@H]1OC(C)=O)S(=O)Cc1cn(nn1)-c1ccc(cc1)S(N)(=O)=O
: