Target
Heat shock protein HSP 90-beta
Ligand
BDBM50180301
Substrate
Meas. Tech.
ChEMBL_543937 (CHEMBL1020372)
EC50
22±n/a nM
Citation
 Taldone, TSun, WChiosis, G Discovery and development of heat shock protein 90 inhibitors. Bioorg Med Chem 17:2225-35 (2009)  
Target
Name:
Heat shock protein HSP 90-beta
Synonyms:
HS90B_HUMAN HSP 90 HSP90B HSPCB Heat shock protein HSP 90 (Hsp90)
Type:
Molecular Chaperone
Mol. Mass.:
83229.45
Organism:
Homo sapiens (Human)
Description:
P08238
Residue:
724
  
Inhibitor
Name:
BDBM50180301
Synonyms:
2-FLUORO-8-[(6-IODO-1,3-BENZODIOXOL-5-YL)METHYL]-9-[3-(ISOPROPYLAMINO)PROPYL]-9H-PURIN-6-AMINE 2-fluoro-8-(6-iodo-benzo[1,3]dioxol-5-ylmethyl)-9-(3-isopropylamino-propyl)adenine US10336757, Compound PU-DZ8 | US10676476, Example 8
Type:
Small organic molecule
Emp. Form.:
C19H22FIN6O2
Mol. Mass.:
512.3199
SMILES:
CC(C)NCCCn1c(Cc2cc3OCOc3cc2I)nc2c(N)nc(F)nc12
: