Target
Insulin-like growth factor 1 receptor
Ligand
BDBM50265849
Substrate
Meas. Tech.
ChEMBL_540379 (CHEMBL1025722)
IC50
0.5±n/a nM
Citation
 Chamberlain, SDRedman, AMPatnaik, SBrickhouse, KChew, YCDeanda, FGerding, RLei, HMoorthy, GPatrick, MStevens, KLWilson, JWBrad Shotwell, J Optimization of a series of 4,6-bis-anilino-1H-pyrrolo[2,3-d]pyrimidine inhibitors of IGF-1R: elimination of an acid-mediated decomposition pathway. Bioorg Med Chem Lett 19:373-7 (2008)  
Target
Name:
Insulin-like growth factor 1 receptor
Synonyms:
CD_antigen=CD221 IGF1R Insulin-like growth factor 1 receptor (IGF1R) Insulin-like growth factor 1 receptor alpha chain Insulin-like growth factor I receptor | Insulin-like growth factor receptor (IGFR)
Type:
Protein
Mol. Mass.:
154776.79
Organism:
Homo sapiens (Human)
Description:
P08069
Residue:
1367
  
Inhibitor
Name:
BDBM50265849
Synonyms:
2-(dimethylamino)-1-(7-(4-(indolin-1-yl)-7H-pyrrolo[2,3-d]pyrimidin-2-ylamino)-6-methoxy-3,4-dihydroquinolin-1(2H)-yl)ethanone | CHEMBL457105
Type:
Small organic molecule
Emp. Form.:
C28H31N7O2
Mol. Mass.:
497.5914
SMILES:
COc1cc2CCCN(C(=O)CN(C)C)c2cc1Nc1nc(N2CCc3ccccc23)c2cc[nH]c2n1
: