Target
Insulin-like growth factor 1 receptor
Ligand
BDBM50265871
Substrate
Meas. Tech.
ChEMBL_540379 (CHEMBL1025722)
IC50
0.2±n/a nM
Citation
 Chamberlain, SDRedman, AMPatnaik, SBrickhouse, KChew, YCDeanda, FGerding, RLei, HMoorthy, GPatrick, MStevens, KLWilson, JWBrad Shotwell, J Optimization of a series of 4,6-bis-anilino-1H-pyrrolo[2,3-d]pyrimidine inhibitors of IGF-1R: elimination of an acid-mediated decomposition pathway. Bioorg Med Chem Lett 19:373-7 (2008)  
Target
Name:
Insulin-like growth factor 1 receptor
Synonyms:
CD_antigen=CD221 IGF1R Insulin-like growth factor 1 receptor (IGF1R) Insulin-like growth factor 1 receptor alpha chain Insulin-like growth factor I receptor | Insulin-like growth factor receptor (IGFR)
Type:
Protein
Mol. Mass.:
154776.79
Organism:
Homo sapiens (Human)
Description:
P08069
Residue:
1367
  
Inhibitor
Name:
BDBM50265871
Synonyms:
3-(2-(1-(2-(dimethylamino)acetyl)-6-methoxy-4,4-dimethyl-1,2,3,4-tetrahydroquinolin-7-ylamino)-7H-pyrrolo[2,3-d]pyrimidin-4-ylamino)thiophene-2-carboxamide | CHEMBL463931
Type:
Small organic molecule
Emp. Form.:
C27H32N8O3S
Mol. Mass.:
548.66
SMILES:
COc1cc2c(cc1Nc1nc(Nc3ccsc3C(N)=O)c3cc[nH]c3n1)N(CCC2(C)C)C(=O)CN(C)C
: