Target
Insulin-like growth factor 1 receptor
Ligand
BDBM50265847
Substrate
Meas. Tech.
ChEMBL_540379 (CHEMBL1025722)
IC50
0.3±n/a nM
Citation
 Chamberlain, SDRedman, AMPatnaik, SBrickhouse, KChew, YCDeanda, FGerding, RLei, HMoorthy, GPatrick, MStevens, KLWilson, JWBrad Shotwell, J Optimization of a series of 4,6-bis-anilino-1H-pyrrolo[2,3-d]pyrimidine inhibitors of IGF-1R: elimination of an acid-mediated decomposition pathway. Bioorg Med Chem Lett 19:373-7 (2008)  
Target
Name:
Insulin-like growth factor 1 receptor
Synonyms:
CD_antigen=CD221 IGF1R Insulin-like growth factor 1 receptor (IGF1R) Insulin-like growth factor 1 receptor alpha chain Insulin-like growth factor I receptor | Insulin-like growth factor receptor (IGFR)
Type:
Protein
Mol. Mass.:
154776.79
Organism:
Homo sapiens (Human)
Description:
P08069
Residue:
1367
  
Inhibitor
Name:
BDBM50265847
Synonyms:
3-(2-(1-(2-(dimethylamino)acetyl)-6-methoxy-1,2,3,4-tetrahydroquinolin-7-ylamino)-7H-pyrrolo[2,3-d]pyrimidin-4-ylamino)furan-2-carboxamide | CHEMBL458414
Type:
Small organic molecule
Emp. Form.:
C25H28N8O4
Mol. Mass.:
504.541
SMILES:
COc1cc2CCCN(C(=O)CN(C)C)c2cc1Nc1nc(Nc2ccoc2C(N)=O)c2cc[nH]c2n1
: