Target
Adenosine receptor A2b
Ligand
BDBM10847
Substrate
Meas. Tech.
ChEMBL_520168 (CHEMBL947856)
Ki
7850±n/a nM
Citation
 Borrmann, THinz, SBertarelli, DCLi, WFlorin, NCScheiff, ABMüller, CE 1-alkyl-8-(piperazine-1-sulfonyl)phenylxanthines: development and characterization of adenosine A2B receptor antagonists and a new radioligand with subnanomolar affinity and subtype specificity. J Med Chem 52:3994-4006 (2009)  
Target
Name:
Adenosine receptor A2b
Synonyms:
AA2BR_HUMAN ADORA2B Adenosine receptors A2b | Adenosine receptors; A2a & A2b
Type:
G Protein-Coupled Receptor (GPCR)
Mol. Mass.:
36341.22
Organism:
Homo sapiens (Human)
Description:
Residue:
332
  
Inhibitor
Name:
BDBM10847
Synonyms:
1,3-dimethyl-2,3,6,7-tetrahydro-1H-purine-2,6-dione Afonilum Aminophylline Cardophyllin Theophy-lline Theophylline (1,3-dimethylxanthine)
Type:
Small organic molecule
Emp. Form.:
C7H8N4O2
Mol. Mass.:
180.164
SMILES:
Cn1c2nc[nH]c2c(=O)n(C)c1=O
: