Target
Adenosine receptor A1
Ligand
BDBM50268107
Substrate
Meas. Tech.
ChEMBL_520166 (CHEMBL947854)
Ki
37±n/a nM
Citation
 Borrmann, THinz, SBertarelli, DCLi, WFlorin, NCScheiff, ABMüller, CE 1-alkyl-8-(piperazine-1-sulfonyl)phenylxanthines: development and characterization of adenosine A2B receptor antagonists and a new radioligand with subnanomolar affinity and subtype specificity. J Med Chem 52:3994-4006 (2009)  
Target
Name:
Adenosine receptor A1
Synonyms:
A1 adenosine receptor (hA1) AA1R_HUMAN ADORA1 Adenosine A1-receptor Adenosine receptor A1 (hA1) | Adenosine transporter (AdT)
Type:
G Protein-Coupled Receptor (GPCR)
Mol. Mass.:
36520.92
Organism:
Homo sapiens (Human)
Description:
P30542
Residue:
326
  
Inhibitor
Name:
BDBM50268107
Synonyms:
CHEMBL485862 N-(2-(2-phenyl-6-(4-(3-phenylpropyl)piperazine-1-carbonyl)-7H-pyrrolo[2,3-d]pyrimidin-4-ylamino)ethyl)acetamide | OSIP-339391
Type:
Small organic molecule
Emp. Form.:
C30H35N7O2
Mol. Mass.:
525.6446
SMILES:
CC(=O)NCCNc1nc(nc2[nH]c(cc12)C(=O)N1CCN(CCCc2ccccc2)CC1)-c1ccccc1
: