Target
Glutathione reductase, mitochondrial
Ligand
BDBM50293665
Substrate
Meas. Tech.
ChEMBL_571638 (CHEMBL1031293)
Ki
18400±n/a nM
Citation
 Sentürk, MTalaz, OEkinci, DCavdar, HKüfrevioglu, OI In vitro inhibition of human erythrocyte glutathione reductase by some new organic nitrates. Bioorg Med Chem Lett 19:3661-3 (2009)  
Target
Name:
Glutathione reductase, mitochondrial
Synonyms:
GLUR GSHR_HUMAN Glutathione reductase | Glutathione reductase (GR)
Type:
Enzyme
Mol. Mass.:
56271.52
Organism:
Homo sapiens (Human)
Description:
P00390
Residue:
522
  
Inhibitor
Name:
BDBM50293665
Synonyms:
(1R(S),2R(S),4R(S),5R(S))-2,5-Dihydroxycyclo-hexane-1,4-diyl dinitrate | CHEMBL561901
Type:
Small organic molecule
Emp. Form.:
C6H10N2O8
Mol. Mass.:
238.1522
SMILES:
OC1CC(O[N+]([O-])=O)C(O)CC1O[N+]([O-])=O
: