Target
Purine nucleoside phosphorylase
Ligand
BDBM50294725
Substrate
Meas. Tech.
ChEMBL_576021 (CHEMBL1023647)
IC50
100±n/a nM
Citation
 Kamath, VPXue, JJuarez-Brambila, JJ Synthesis of analogs of forodesine HCl, a human purine nucleoside phosphorylase inhibitor-Part II. Bioorg Med Chem Lett 19:2627-9 (2009)  
Target
Name:
Purine nucleoside phosphorylase
Synonyms:
Inosine phosphorylase NP PNPH_HUMAN | Purine nucleoside phosphorylase (PNPase)
Type:
Enzyme
Mol. Mass.:
32119.53
Organism:
Homo sapiens (Human)
Description:
Residue:
289
  
Inhibitor
Name:
BDBM50294725
Synonyms:
7-((2S,3R,4R,5R)-3,4-dihydroxy-5-(hydroxymethyl)pyrrolidin-2-yl)-3H-pyrrolo[3,2-d]pyrimidin-4(5H)-one | CHEMBL565167
Type:
Small organic molecule
Emp. Form.:
C11H14N4O4
Mol. Mass.:
266.2533
SMILES:
OC[C@H]1N[C@H]([C@@H](O)[C@@H]1O)c1c[nH]c2c1nc[nH]c2=O
: