Target
Sigma non-opioid intracellular receptor 1
Ligand
BDBM50248958
Substrate
Meas. Tech.
ChEMBL_578681 (CHEMBL1063062)
Ki
394±n/a nM
Citation
 Zampieri, DMamolo, MGLaurini, EFlorio, CZanette, CFermeglia, MPosocco, PPaneni, MSPricl, SVio, L Synthesis, biological evaluation, and three-dimensional in silico pharmacophore model for sigma(1) receptor ligands based on a series of substituted benzo[d]oxazol-2(3H)-one derivatives. J Med Chem 52:5380-93 (2009)  
Target
Name:
Sigma non-opioid intracellular receptor 1
Synonyms:
Opioid receptor SGMR1_RAT Sigma non-opioid intracellular receptor 1 Sigma-1 | Sigmar1
Type:
Enzyme Catalytic Domain
Mol. Mass.:
25266.54
Organism:
RAT
Description:
Q9R0C9
Residue:
223
  
Inhibitor
Name:
BDBM50248958
Synonyms:
3-((1-(biphenyl-4-ylmethyl)piperidin-4-yl)methyl)benzo[d]oxazol-2(3H)-one CHEMBL474567
Type:
Small organic molecule
Emp. Form.:
C26H26N2O2
Mol. Mass.:
398.4968
SMILES:
O=c1oc2ccccc2n1CC1CCN(Cc2ccc(cc2)-c2ccccc2)CC1
: