Target
Sigma non-opioid intracellular receptor 1
Ligand
BDBM50295406
Substrate
Meas. Tech.
ChEMBL_578681 (CHEMBL1063062)
Ki
871±n/a nM
Citation
 Zampieri, DMamolo, MGLaurini, EFlorio, CZanette, CFermeglia, MPosocco, PPaneni, MSPricl, SVio, L Synthesis, biological evaluation, and three-dimensional in silico pharmacophore model for sigma(1) receptor ligands based on a series of substituted benzo[d]oxazol-2(3H)-one derivatives. J Med Chem 52:5380-93 (2009)  
Target
Name:
Sigma non-opioid intracellular receptor 1
Synonyms:
Opioid receptor SGMR1_RAT Sigma non-opioid intracellular receptor 1 Sigma-1 | Sigmar1
Type:
Enzyme Catalytic Domain
Mol. Mass.:
25266.54
Organism:
RAT
Description:
Q9R0C9
Residue:
223
  
Inhibitor
Name:
BDBM50295406
Synonyms:
3-[3-[N-Methylamino-N-(4-methylbenzyl)]propyl]benzo[d]oxazol-2(3H)-one | CHEMBL540232
Type:
Small organic molecule
Emp. Form.:
C19H22N2O2
Mol. Mass.:
310.3902
SMILES:
CN(CCCn1c2ccccc2oc1=O)Cc1ccc(C)cc1
: