Target
Serine/threonine-protein kinase pim-2
Ligand
BDBM92455
Substrate
Meas. Tech.
ChEMBL_587004 (CHEMBL1062793)
IC50
110±n/a nM
Citation
 Bain, JPlater, LElliott, MShpiro, NHastie, CJMcLauchlan, HKlevernic, IArthur, JSAlessi, DRCohen, P The selectivity of protein kinase inhibitors: a further update. Biochem J 408:297-315 (2007)  
Target
Name:
Serine/threonine-protein kinase pim-2
Synonyms:
PIM2 Pim-2h Serine/threonine-protein kinase PIM | Serine/threonine-protein kinase pim-2 (PIM2)
Type:
Serine/threonine-protein kinase
Mol. Mass.:
34185.93
Organism:
Homo sapiens (Human)
Description:
Q9P1W9
Residue:
311
  
Inhibitor
Name:
BDBM92455
Synonyms:
CHEMBL265470 | STO-609
Type:
Small organic molecule
Emp. Form.:
C19H10N2O3
Mol. Mass.:
314.2943
SMILES:
OC(=O)c1ccc2c3nc4ccccc4n3c(=O)c3cccc1c23
: