Target
Dual specificity tyrosine-phosphorylation-regulated kinase 2
Ligand
BDBM50169959
Substrate
Meas. Tech.
ChEMBL_586737 (CHEMBL1062881)
IC50
300±n/a nM
Citation
 Bain, JPlater, LElliott, MShpiro, NHastie, CJMcLauchlan, HKlevernic, IArthur, JSAlessi, DRCohen, P The selectivity of protein kinase inhibitors: a further update. Biochem J 408:297-315 (2007)  
Target
Name:
Dual specificity tyrosine-phosphorylation-regulated kinase 2
Synonyms:
DYRK2 Dual-specificity tyrosine-phosphorylation regulated kinase 2
Type:
PROTEIN
Mol. Mass.:
66690.69
Organism:
Homo sapiens (Human)
Description:
ChEMBL_1508025
Residue:
601
  
Inhibitor
Name:
BDBM50169959
Synonyms:
2-(benzo[d]thiazol-2(3H)-ylidene)-2-(2-(2-(pyridin-3-yl)ethylamino)pyrimidin-4-yl)acetonitrile AS601245 CHEMBL191384 | [3H-Benzothiazol-(2Z)-ylidene]-[2-(2-pyridin-3-yl-ethylamino)-pyrimidin-4-yl]-acetonitrile
Type:
Small organic molecule
Emp. Form.:
C20H16N6S
Mol. Mass.:
372.446
SMILES:
N#CC(c1nc2ccccc2s1)c1ccnc(NCCc2cccnc2)n1
: