Target
Ephrin type-A receptor 4
Ligand
BDBM31085
Substrate
Meas. Tech.
ChEMBL_586961 (CHEMBL1061895)
Kd
400±n/a nM
Citation
 Karaman, MWHerrgard, STreiber, DKGallant, PAtteridge, CECampbell, BTChan, KWCiceri, PDavis, MIEdeen, PTFaraoni, RFloyd, MHunt, JPLockhart, DJMilanov, ZVMorrison, MJPallares, GPatel, HKPritchard, SWodicka, LMZarrinkar, PP A quantitative analysis of kinase inhibitor selectivity. Nat Biotechnol 26:127-32 (2008)  
Target
Name:
Ephrin type-A receptor 4
Synonyms:
EPHA4 Ephrin receptor HEK8 TYRO1
Type:
PROTEIN
Mol. Mass.:
109859.29
Organism:
Homo sapiens (Human)
Description:
ChEMBL_586961
Residue:
986
  
Inhibitor
Name:
BDBM31085
Synonyms:
1-[4-[(4-ethyl-1-piperazinyl)methyl]-3-(trifluoromethyl)phenyl]-3-[4-[[6-(methylamino)-4-pyrimidinyl]oxy]phenyl]urea 1-[4-[(4-ethylpiperazino)methyl]-3-(trifluoromethyl)phenyl]-3-[4-[6-(methylamino)pyrimidin-4-yl]oxyphenyl]urea cid_11409972
Type:
Small organic molecule
Emp. Form.:
C26H30F3N7O2
Mol. Mass.:
529.5573
SMILES:
CCN1CCN(Cc2ccc(NC(=O)Nc3ccc(Oc4cc(NC)ncn4)cc3)cc2C(F)(F)F)CC1
: