Target
Serine/threonine-protein kinase receptor R3
Ligand
BDBM13530
Substrate
Meas. Tech.
ChEMBL_586811 (CHEMBL1063790)
Kd
>10000±n/a nM
Citation
 Karaman, MWHerrgard, STreiber, DKGallant, PAtteridge, CECampbell, BTChan, KWCiceri, PDavis, MIEdeen, PTFaraoni, RFloyd, MHunt, JPLockhart, DJMilanov, ZVMorrison, MJPallares, GPatel, HKPritchard, SWodicka, LMZarrinkar, PP A quantitative analysis of kinase inhibitor selectivity. Nat Biotechnol 26:127-32 (2008)  
Target
Name:
Serine/threonine-protein kinase receptor R3
Synonyms:
ACVL1_HUMAN ACVRLK1 Activin receptor-like kinase 1 (ALK-1) | Serine/threonine-protein kinase receptor R3 (ALK1)
Type:
Enzyme
Mol. Mass.:
56134.46
Organism:
Homo sapiens (Human)
Description:
P37023
Residue:
503
  
Inhibitor
Name:
BDBM13530
Synonyms:
4-[(4-methylpiperazin-1-yl)methyl]-N-[4-methyl-3-[(4-pyridin-3-ylpyrimidin-2-yl)amino]phenyl]benzamide Gleevec Imatinib, 21 STI-571 US10906896, Cpd imatinib US11725005, Compound imatinib cid_5291 med.21724, Compound 6
Type:
Small organic molecule
Emp. Form.:
C29H31N7O
Mol. Mass.:
493.6027
SMILES:
CN1CCN(Cc2ccc(cc2)C(=O)Nc2ccc(C)c(Nc3nccc(n3)-c3cccnc3)c2)CC1
: