Target
Calcium/calmodulin-dependent protein kinase type II subunit delta
Ligand
BDBM4814
Substrate
Meas. Tech.
ChEMBL_586813 (CHEMBL1063792)
Kd
420±n/a nM
Citation
 Karaman, MWHerrgard, STreiber, DKGallant, PAtteridge, CECampbell, BTChan, KWCiceri, PDavis, MIEdeen, PTFaraoni, RFloyd, MHunt, JPLockhart, DJMilanov, ZVMorrison, MJPallares, GPatel, HKPritchard, SWodicka, LMZarrinkar, PP A quantitative analysis of kinase inhibitor selectivity. Nat Biotechnol 26:127-32 (2008)  
Target
Name:
Calcium/calmodulin-dependent protein kinase type II subunit delta
Synonyms:
CAMK2D CaM kinase II CaMK-II subunit delta Calcium/calmodulin-dependent protein kinase type II subunit delta (CAMK2D) KCC2D_HUMAN
Type:
Enzyme Catalytic Domain
Mol. Mass.:
56419.78
Organism:
Homo sapiens (Human)
Description:
Q13557
Residue:
499
  
Inhibitor
Name:
BDBM4814
Synonyms:
CHEMBL535 N-[2-(diethylamino)ethyl]-5-{[(3Z)-5-fluoro-2-oxo-2,3-dihydro-1H-indol-3-ylidene]methyl}-2,4-dimethyl-1H-pyrrole-3-carboxamide SUNITINIB US10464902, Sunitinib US9163010, Sunitinib | US9914707, SU11248
Type:
Small organic molecule
Emp. Form.:
C22H27FN4O2
Mol. Mass.:
398.4738
SMILES:
CCN(CC)CCNC(=O)c1c(C)[nH]c(\C=C2/C(=O)Nc3ccc(F)cc23)c1C
: