Target
Carbonic anhydrase 1
Ligand
BDBM10860
Substrate
Meas. Tech.
ChEMBL_587741 (CHEMBL1038577)
Ki
25000±n/a nM
Citation
 Bertucci, AInnocenti, AZoccola, DScozzafava, ATambutté, SSupuran, CT Carbonic anhydrase inhibitors. Inhibition studies of a coral secretory isoform by sulfonamides. Bioorg Med Chem 17:5054-8 (2009)  
Target
Name:
Carbonic anhydrase 1
Synonyms:
CA-I CAB Carbonate dehydratase I Carbonic anhydrase 1 (CA I) Carbonic anhydrase 1 (Recombinant CA I) Carbonic anhydrase B Carbonic anhydrase I (CA I) Carbonic anhydrase I (CAI) Carbonic anhydrase isoenzyme I (hCA I) | hCA
Type:
Enzyme
Mol. Mass.:
28873.37
Organism:
Homo sapiens (Human)
Description:
P00915
Residue:
261
  
Inhibitor
Name:
BDBM10860
Synonyms:
4-(aminomethyl)benzene-1-sulfonamide MAFENIDE aromatic/heteroaromatic sulfonamide 5 | hCA inhibitor, 9
Type:
Small organic molecule
Emp. Form.:
C7H10N2O2S
Mol. Mass.:
186.232
SMILES:
NCc1ccc(cc1)S(N)(=O)=O
: