Target
D(1A) dopamine receptor
Ligand
BDBM50274531
Substrate
Meas. Tech.
ChEMBL_588077 (CHEMBL1041329)
Ki
1.93±n/a nM
Citation
 Zhang, JZhang, HCai, WYu, LZhen, XZhang, A 'Click' D(1) receptor agonists with a 5-HT(1A) receptor pharmacophore producing D(2) receptor activity. Bioorg Med Chem 17:4873-80 (2009)  
Target
Name:
D(1A) dopamine receptor
Synonyms:
DA D1 receptor DRD1 Dopamine D1 receptor Dopamine D1A
Type:
Enzyme
Mol. Mass.:
49303.43
Organism:
Homo sapiens (Human)
Description:
P21728
Residue:
446
  
Inhibitor
Name:
BDBM50274531
Synonyms:
6-Chloro-3-methyl-1-m-tolyl-2,3,4,5-tetrahydro-1H-benzo[d]azepine-7,8-diol; hydrobromide CHEMBL520992 SKF-83959
Type:
Small organic molecule
Emp. Form.:
C18H20ClNO2
Mol. Mass.:
317.81
SMILES:
CN1CCc2c(Cl)c(O)c(O)cc2C(C1)c1cccc(C)c1
: