Target
D(1A) dopamine receptor
Ligand
BDBM50298789
Substrate
Meas. Tech.
ChEMBL_588077 (CHEMBL1041329)
Ki
963±n/a nM
Citation
 Zhang, JZhang, HCai, WYu, LZhen, XZhang, A 'Click' D(1) receptor agonists with a 5-HT(1A) receptor pharmacophore producing D(2) receptor activity. Bioorg Med Chem 17:4873-80 (2009)  
Target
Name:
D(1A) dopamine receptor
Synonyms:
DA D1 receptor DRD1 Dopamine D1 receptor Dopamine D1A
Type:
Enzyme
Mol. Mass.:
49303.43
Organism:
Homo sapiens (Human)
Description:
P21728
Residue:
446
  
Inhibitor
Name:
BDBM50298789
Synonyms:
(rac)-3-(3-(1-(3-(4-(Pyrimidin-2-yl)piperazin-1-yl)propyl)-1H-1,2,3-triazol-4-yl)propyl)-1-m-tolyl-2,3,4,5-tetrahydro-1Hbenzo[d]azepine-7,8-diol | CHEMBL574627
Type:
Small organic molecule
Emp. Form.:
C33H42N8O2
Mol. Mass.:
582.739
SMILES:
Cc1cccc(c1)C1CN(CCCc2cn(CCCN3CCN(CC3)c3ncccn3)nn2)CCc2cc(O)c(O)cc12
: