Target
D(1A) dopamine receptor
Ligand
BDBM50298791
Substrate
Meas. Tech.
ChEMBL_588077 (CHEMBL1041329)
Ki
221±n/a nM
Citation
 Zhang, JZhang, HCai, WYu, LZhen, XZhang, A 'Click' D(1) receptor agonists with a 5-HT(1A) receptor pharmacophore producing D(2) receptor activity. Bioorg Med Chem 17:4873-80 (2009)  
Target
Name:
D(1A) dopamine receptor
Synonyms:
DA D1 receptor DRD1 Dopamine D1 receptor Dopamine D1A
Type:
Enzyme
Mol. Mass.:
49303.43
Organism:
Homo sapiens (Human)
Description:
P21728
Residue:
446
  
Inhibitor
Name:
BDBM50298791
Synonyms:
(rac)-3-(3-(1-(3-(4-(Benzo[d]isothiazol-3-yl)piperazin-1-yl)-propyl)-1H-1,2,3-triazol-4-yl)propyl)-1-m-tolyl-2,3,4,5-tetrahydro-1H-benzo[d]azepine-7,8-diol | CHEMBL585741
Type:
Small organic molecule
Emp. Form.:
C36H43N7O2S
Mol. Mass.:
637.837
SMILES:
Cc1cccc(c1)C1CN(CCCc2cn(CCCN3CCN(CC3)c3nsc4ccccc34)nn2)CCc2cc(O)c(O)cc12
: