Target
D(1A) dopamine receptor
Ligand
BDBM50298794
Substrate
Meas. Tech.
ChEMBL_588077 (CHEMBL1041329)
Ki
551±n/a nM
Citation
 Zhang, JZhang, HCai, WYu, LZhen, XZhang, A 'Click' D(1) receptor agonists with a 5-HT(1A) receptor pharmacophore producing D(2) receptor activity. Bioorg Med Chem 17:4873-80 (2009)  
Target
Name:
D(1A) dopamine receptor
Synonyms:
DA D1 receptor DRD1 Dopamine D1 receptor Dopamine D1A
Type:
Enzyme
Mol. Mass.:
49303.43
Organism:
Homo sapiens (Human)
Description:
P21728
Residue:
446
  
Inhibitor
Name:
BDBM50298794
Synonyms:
(rac)-3-(3-(4-(3-(4-(2-Methoxyphenyl)piperazin-1-yl)propyl)-1H-1,2,3-triazol-1-yl)propyl)-1-o-tolyl-2,3,4,5-tetrahydro-1Hbenzo[d]azepine-7,8-diol | CHEMBL574700
Type:
Small organic molecule
Emp. Form.:
C36H46N6O3
Mol. Mass.:
610.7888
SMILES:
COc1ccccc1N1CCN(CCCc2cn(CCCN3CCc4cc(O)c(O)cc4C(C3)c3ccccc3C)nn2)CC1
: