Target
D(2) dopamine receptor
Ligand
BDBM50298791
Substrate
Meas. Tech.
ChEMBL_588079 (CHEMBL1041331)
Ki
200±n/a nM
Citation
 Zhang, JZhang, HCai, WYu, LZhen, XZhang, A 'Click' D(1) receptor agonists with a 5-HT(1A) receptor pharmacophore producing D(2) receptor activity. Bioorg Med Chem 17:4873-80 (2009)  
Target
Name:
D(2) dopamine receptor
Synonyms:
D(2) dopamine receptor DOPAMINE D2 Long DRD2 Dopamine D2 receptor Dopamine D2 receptor (D2R) Dopamine2-like | d2
Type:
Cell-surface receptors
Mol. Mass.:
50647.10
Organism:
Homo sapiens (Human)
Description:
P14416
Residue:
443
  
Inhibitor
Name:
BDBM50298791
Synonyms:
(rac)-3-(3-(1-(3-(4-(Benzo[d]isothiazol-3-yl)piperazin-1-yl)-propyl)-1H-1,2,3-triazol-4-yl)propyl)-1-m-tolyl-2,3,4,5-tetrahydro-1H-benzo[d]azepine-7,8-diol | CHEMBL585741
Type:
Small organic molecule
Emp. Form.:
C36H43N7O2S
Mol. Mass.:
637.837
SMILES:
Cc1cccc(c1)C1CN(CCCc2cn(CCCN3CCN(CC3)c3nsc4ccccc34)nn2)CCc2cc(O)c(O)cc12
: