Target
D(2) dopamine receptor
Ligand
BDBM50298794
Substrate
Meas. Tech.
ChEMBL_588079 (CHEMBL1041331)
Ki
19.1±n/a nM
Citation
 Zhang, JZhang, HCai, WYu, LZhen, XZhang, A 'Click' D(1) receptor agonists with a 5-HT(1A) receptor pharmacophore producing D(2) receptor activity. Bioorg Med Chem 17:4873-80 (2009)  
Target
Name:
D(2) dopamine receptor
Synonyms:
D(2) dopamine receptor DOPAMINE D2 Long DRD2 Dopamine D2 receptor Dopamine D2 receptor (D2R) Dopamine2-like | d2
Type:
Cell-surface receptors
Mol. Mass.:
50647.10
Organism:
Homo sapiens (Human)
Description:
P14416
Residue:
443
  
Inhibitor
Name:
BDBM50298794
Synonyms:
(rac)-3-(3-(4-(3-(4-(2-Methoxyphenyl)piperazin-1-yl)propyl)-1H-1,2,3-triazol-1-yl)propyl)-1-o-tolyl-2,3,4,5-tetrahydro-1Hbenzo[d]azepine-7,8-diol | CHEMBL574700
Type:
Small organic molecule
Emp. Form.:
C36H46N6O3
Mol. Mass.:
610.7888
SMILES:
COc1ccccc1N1CCN(CCCc2cn(CCCN3CCc4cc(O)c(O)cc4C(C3)c3ccccc3C)nn2)CC1
: