Target
5-hydroxytryptamine receptor 1A
Ligand
BDBM50274531
Substrate
Meas. Tech.
ChEMBL_588083 (CHEMBL1043963)
Ki
>1000±n/a nM
Citation
 Zhang, JZhang, HCai, WYu, LZhen, XZhang, A 'Click' D(1) receptor agonists with a 5-HT(1A) receptor pharmacophore producing D(2) receptor activity. Bioorg Med Chem 17:4873-80 (2009)  
Target
Name:
5-hydroxytryptamine receptor 1A
Synonyms:
5-HT-1A 5-hydroxytryptamine receptor 1A (5-HT-1A) ADRB2RL1 Dopamine D2 receptor and serotonin 1a receptor HTR1A | Serotonin receptor 1A
Type:
Mol. Mass.:
46122.49
Organism:
Homo sapiens (Human)
Description:
Residue:
422
  
Inhibitor
Name:
BDBM50274531
Synonyms:
6-Chloro-3-methyl-1-m-tolyl-2,3,4,5-tetrahydro-1H-benzo[d]azepine-7,8-diol; hydrobromide CHEMBL520992 SKF-83959
Type:
Small organic molecule
Emp. Form.:
C18H20ClNO2
Mol. Mass.:
317.81
SMILES:
CN1CCc2c(Cl)c(O)c(O)cc2C(C1)c1cccc(C)c1
: