Target
5-hydroxytryptamine receptor 1A
Ligand
BDBM50298795
Substrate
Meas. Tech.
ChEMBL_588083 (CHEMBL1043963)
Ki
799±n/a nM
Citation
 Zhang, JZhang, HCai, WYu, LZhen, XZhang, A 'Click' D(1) receptor agonists with a 5-HT(1A) receptor pharmacophore producing D(2) receptor activity. Bioorg Med Chem 17:4873-80 (2009)  
Target
Name:
5-hydroxytryptamine receptor 1A
Synonyms:
5-HT-1A 5-hydroxytryptamine receptor 1A (5-HT-1A) ADRB2RL1 Dopamine D2 receptor and serotonin 1a receptor HTR1A | Serotonin receptor 1A
Type:
Mol. Mass.:
46122.49
Organism:
Homo sapiens (Human)
Description:
Residue:
422
  
Inhibitor
Name:
BDBM50298795
Synonyms:
(rac)-3-(3-(1-(3-(4-(Pyrimidin-2-yl)piperazin-1-yl)propyl)-1H-1,2,3-triazol-4-yl)propyl)-1-o-tolyl-2,3,4,5-tetrahydro-1Hbenzo[d]azepine-7,8-diol | CHEMBL575203
Type:
Small organic molecule
Emp. Form.:
C33H42N8O2
Mol. Mass.:
582.739
SMILES:
Cc1ccccc1C1CN(CCCc2cn(CCCN3CCN(CC3)c3ncccn3)nn2)CCc2cc(O)c(O)cc12
: