Target
5-hydroxytryptamine receptor 1A
Ligand
BDBM50298791
Substrate
Meas. Tech.
ChEMBL_588083 (CHEMBL1043963)
Ki
235±n/a nM
Citation
 Zhang, JZhang, HCai, WYu, LZhen, XZhang, A 'Click' D(1) receptor agonists with a 5-HT(1A) receptor pharmacophore producing D(2) receptor activity. Bioorg Med Chem 17:4873-80 (2009)  
Target
Name:
5-hydroxytryptamine receptor 1A
Synonyms:
5-HT-1A 5-hydroxytryptamine receptor 1A (5-HT-1A) ADRB2RL1 Dopamine D2 receptor and serotonin 1a receptor HTR1A | Serotonin receptor 1A
Type:
Mol. Mass.:
46122.49
Organism:
Homo sapiens (Human)
Description:
Residue:
422
  
Inhibitor
Name:
BDBM50298791
Synonyms:
(rac)-3-(3-(1-(3-(4-(Benzo[d]isothiazol-3-yl)piperazin-1-yl)-propyl)-1H-1,2,3-triazol-4-yl)propyl)-1-m-tolyl-2,3,4,5-tetrahydro-1H-benzo[d]azepine-7,8-diol | CHEMBL585741
Type:
Small organic molecule
Emp. Form.:
C36H43N7O2S
Mol. Mass.:
637.837
SMILES:
Cc1cccc(c1)C1CN(CCCc2cn(CCCN3CCN(CC3)c3nsc4ccccc34)nn2)CCc2cc(O)c(O)cc12
: