Target
5-hydroxytryptamine receptor 1A
Ligand
BDBM50298797
Substrate
Meas. Tech.
ChEMBL_588083 (CHEMBL1043963)
Ki
381±n/a nM
Citation
 Zhang, JZhang, HCai, WYu, LZhen, XZhang, A 'Click' D(1) receptor agonists with a 5-HT(1A) receptor pharmacophore producing D(2) receptor activity. Bioorg Med Chem 17:4873-80 (2009)  
Target
Name:
5-hydroxytryptamine receptor 1A
Synonyms:
5-HT-1A 5-hydroxytryptamine receptor 1A (5-HT-1A) ADRB2RL1 Dopamine D2 receptor and serotonin 1a receptor HTR1A | Serotonin receptor 1A
Type:
Mol. Mass.:
46122.49
Organism:
Homo sapiens (Human)
Description:
Residue:
422
  
Inhibitor
Name:
BDBM50298797
Synonyms:
CHEMBL572490 | N,N-Diethyl-3-(1-(3-(4-(2-methoxyphenyl)piperazin-1-yl)propyl)-1H-1,2,3-triazol-4-yl)propan-1-amine
Type:
Small organic molecule
Emp. Form.:
C23H38N6O
Mol. Mass.:
414.5874
SMILES:
CCN(CC)CCCc1cn(CCCN2CCN(CC2)c2ccccc2OC)nn1
: