Target
D(1A) dopamine receptor
Ligand
BDBM50298793
Substrate
Meas. Tech.
ChEMBL_588089 (CHEMBL1044815)
IC50
32700±n/a nM
Citation
 Zhang, JZhang, HCai, WYu, LZhen, XZhang, A 'Click' D(1) receptor agonists with a 5-HT(1A) receptor pharmacophore producing D(2) receptor activity. Bioorg Med Chem 17:4873-80 (2009)  
Target
Name:
D(1A) dopamine receptor
Synonyms:
DA D1 receptor DRD1 Dopamine D1 receptor Dopamine D1A
Type:
Enzyme
Mol. Mass.:
49303.43
Organism:
Homo sapiens (Human)
Description:
P21728
Residue:
446
  
Inhibitor
Name:
BDBM50298793
Synonyms:
(rac)-3-(4-(1-(3-(4-(2-Methoxyphenyl)piperazin-1-yl)propyl)-1H-1,2,3-triazol-4-yl)butyl)-1-m-tolyl-2,3,4,5-tetrahydro-1Hbenzo[d]azepine-7,8-diol | CHEMBL582945
Type:
Small organic molecule
Emp. Form.:
C37H48N6O3
Mol. Mass.:
624.8154
SMILES:
COc1ccccc1N1CCN(CCCn2cc(CCCCN3CCc4cc(O)c(O)cc4C(C3)c3cccc(C)c3)nn2)CC1
: