Target
Receptor tyrosine-protein kinase erbB-2
Ligand
BDBM50301103
Substrate
Meas. Tech.
ChEMBL_598553 (CHEMBL1043545)
IC50
4.3±n/a nM
Citation
 Li, YLShi, EBurns, DLi, YCovington, MBPan, MScherle, PFriedman, SMetcalf, BYao, W Discovery of novel selective HER-2 sheddase inhibitors through optimization of P1 moiety. Bioorg Med Chem Lett 19:5037-42 (2009)  
Target
Name:
Receptor tyrosine-protein kinase erbB-2
Synonyms:
2.7.10.1 CD_antigen=CD340 ERBB2_HUMAN FASN/HER2 HER2 MLN19 NEU Proto-oncogene Neu Tyrosine kinase-type cell surface receptor HER2 | p185erbB2
Type:
Mol. Mass.:
137894.47
Organism:
Homo sapiens (Human)
Description:
P04626
Residue:
1255
  
Inhibitor
Name:
BDBM50301103
Synonyms:
(2S,3S)-N-hydroxy-5-(2-oxo-2-(pyrrolidin-1-yl)ethyl)-2-(4-phenyl-1,2,3,6-tetrahydropyridine-1-carbonyl)piperidine-3-carboxamide | CHEMBL569166
Type:
Small organic molecule
Emp. Form.:
C24H32N4O4
Mol. Mass.:
440.5353
SMILES:
ONC(=O)[C@H]1CC(CC(=O)N2CCCC2)CN[C@@H]1C(=O)N1CCC(=CC1)c1ccccc1
: