Target
Potassium voltage-gated channel subfamily H member 2
Ligand
BDBM50301708
Substrate
Meas. Tech.
ChEMBL_597859 (CHEMBL1039122)
IC50
3670±n/a nM
Citation
 Suzuki, TKameda, MAndo, MMiyazoe, HSekino, EIto, SMasutani, KKamijo, KTakezawa, AMoriya, MIto, MIto, JNakase, KMatsushita, HIshihara, ATakenaga, NTokita, SKanatani, ASato, NFukami, T Discovery of novel diarylketoxime derivatives as selective and orally active melanin-concentrating hormone 1 receptor antagonists. Bioorg Med Chem Lett 19:5339-45 (2009)  
Target
Name:
Potassium voltage-gated channel subfamily H member 2
Synonyms:
1,3-beta-glucan synthase component GLS2 ERG Eag-related protein 1 Ether-a-go-go-related gene (HERG) Ether-a-go-go-related gene potassium channel 1 Ether-a-go-go-related gene potassium channel 1 (hERG1) Ether-a-go-go-related protein 1 H-ERG KCNH2 Potassium voltage-gated channel subfamily H member 2 (hERG) Voltage-gated potassium channel subunit Kv11.1 hERG Potassium Channel 1 | putative potassium channel subunit
Type:
Multi-pass membrane protein
Mol. Mass.:
126672.65
Organism:
Homo sapiens (Human)
Description:
Q12809
Residue:
1159
  
Inhibitor
Name:
BDBM50301708
Synonyms:
(Z)-1'-((6-((3,4-difluorophenyl)(ethoxyimino)methyl)pyridin-3-yl)methyl)-5-methyl-3H-spiro[furo[3,4-c]pyridine-1,4'-piperidin]-6(5H)-one | CHEMBL585664
Type:
Small organic molecule
Emp. Form.:
C27H28F2N4O3
Mol. Mass.:
494.533
SMILES:
CCO\N=C(\c1ccc(F)c(F)c1)c1ccc(CN2CCC3(CC2)OCc2cn(C)c(=O)cc32)cn1
: