Target
Prostaglandin G/H synthase 2
Ligand
BDBM50303171
Substrate
Meas. Tech.
ChEMBL_594903 (CHEMBL1040774)
IC50
4400±n/a nM
Citation
 Chowdhury, MAAbdellatif, KRDong, YDas, DYu, GVelázquez, CASuresh, MRKnaus, EE Synthesis and biological evaluation of salicylic acid and N-acetyl-2-carboxybenzenesulfonamide regioisomers possessing a N-difluoromethyl-1,2-dihydropyrid-2-one pharmacophore: dual inhibitors of cyclooxygenases and 5-lipoxygenase with anti-inflammatory activity. Bioorg Med Chem Lett 19:6855-61 (2009)  
Target
Name:
Prostaglandin G/H synthase 2
Synonyms:
COX2 Cyclooxygenase 2 (COX-2) Cyclooxygenase-2 (COX-2 AA) Cyclooxygenase-2 (COX-2) PGH2_HUMAN PHS II Prostaglandin E synthase/G/H synthase 2 Prostaglandin-endoperoxide synthase 2
Type:
Enzyme
Mol. Mass.:
69003.89
Organism:
Homo sapiens (Human)
Description:
Recombinant Cox-2 provided by Cayman (Cayman Chemical Co.,Ann Arbor, MI).
Residue:
604
  
Inhibitor
Name:
BDBM50303171
Synonyms:
4-(N-Difluoromethyl-1,2-dihydropyrid-2-one-4-yl)salicylic acid | CHEMBL571658
Type:
Small organic molecule
Emp. Form.:
C13H9F2NO4
Mol. Mass.:
281.2117
SMILES:
OC(=O)c1ccc(cc1O)-c1ccn(C(F)F)c(=O)c1
: