Target
Prostaglandin G/H synthase 1
Ligand
BDBM50303169
Substrate
Meas. Tech.
ChEMBL_594904 (CHEMBL1040775)
IC50
>100000±n/a nM
Citation
 Chowdhury, MAAbdellatif, KRDong, YDas, DYu, GVelázquez, CASuresh, MRKnaus, EE Synthesis and biological evaluation of salicylic acid and N-acetyl-2-carboxybenzenesulfonamide regioisomers possessing a N-difluoromethyl-1,2-dihydropyrid-2-one pharmacophore: dual inhibitors of cyclooxygenases and 5-lipoxygenase with anti-inflammatory activity. Bioorg Med Chem Lett 19:6855-61 (2009)  
Target
Name:
Prostaglandin G/H synthase 1
Synonyms:
COX-1 Cyclooxygenase PGH1_BOVIN | PTGS1
Type:
PROTEIN
Mol. Mass.:
68814.10
Organism:
Bos taurus
Description:
ChEMBL_547440
Residue:
600
  
Inhibitor
Name:
BDBM50303169
Synonyms:
CHEMBL571852 | N-Acetyl-4-(N-difluoromethyl-1,2-dihydropyrid-2-one-4-yl)-2-carboxybenzenesulfonamide
Type:
Small organic molecule
Emp. Form.:
C15H12F2N2O6S
Mol. Mass.:
386.327
SMILES:
CC(=O)NS(=O)(=O)c1ccc(cc1C(O)=O)-c1ccn(C(F)F)c(=O)c1
: