Target
Lipoxygenase
Ligand
BDBM50303171
Substrate
Meas. Tech.
ChEMBL_594906 (CHEMBL1040777)
IC50
4700±n/a nM
Citation
 Chowdhury, MAAbdellatif, KRDong, YDas, DYu, GVelázquez, CASuresh, MRKnaus, EE Synthesis and biological evaluation of salicylic acid and N-acetyl-2-carboxybenzenesulfonamide regioisomers possessing a N-difluoromethyl-1,2-dihydropyrid-2-one pharmacophore: dual inhibitors of cyclooxygenases and 5-lipoxygenase with anti-inflammatory activity. Bioorg Med Chem Lett 19:6855-61 (2009)  
Target
Name:
Lipoxygenase
Synonyms:
5-Lipoxygenase | 5-Lipoxygenase (5-LO)
Type:
Enzyme
Mol. Mass.:
97294.59
Organism:
Solanum tuberosum (potato)
Description:
Residue:
864
  
Inhibitor
Name:
BDBM50303171
Synonyms:
4-(N-Difluoromethyl-1,2-dihydropyrid-2-one-4-yl)salicylic acid | CHEMBL571658
Type:
Small organic molecule
Emp. Form.:
C13H9F2NO4
Mol. Mass.:
281.2117
SMILES:
OC(=O)c1ccc(cc1O)-c1ccn(C(F)F)c(=O)c1
: