Target
P2Y purinoceptor 14
Ligand
BDBM50303340
Substrate
Meas. Tech.
ChEMBL_595741 (CHEMBL1045264)
EC50
142±n/a nM
Citation
 Das, AKo, HBurianek, LEBarrett, MOHarden, TKJacobson, KA Human P2Y(14) receptor agonists: truncation of the hexose moiety of uridine-5'-diphosphoglucose and its replacement with alkyl and aryl groups. J Med Chem 53:471-80 (2010)  
Target
Name:
P2Y purinoceptor 14
Synonyms:
GPR105 KIAA0001 P2Y14_HUMAN | Purinergic receptor P2Y14
Type:
PROTEIN
Mol. Mass.:
38991.62
Organism:
Homo sapiens (Human)
Description:
ChEMBL_1502487
Residue:
338
  
Inhibitor
Name:
BDBM50303340
Synonyms:
({[(2R,3S,4R,5R)-3,4-Dihydroxy-5-(5-iodo-2,4-dioxo-3,4-dihydro-2H-pyrimidin-1-yl)-tetrahydro-furan-2-ylmethoxy]-hydroxy-phosphoryl}-difluoro-methyl)-phosphonic acid | CHEMBL566925
Type:
Small organic molecule
Emp. Form.:
C10H13F2IN2O11P2
Mol. Mass.:
564.0658
SMILES:
O[C@H]1[C@@H](O)[C@@H](O[C@@H]1COP(O)(=O)C(F)(F)P(O)(O)=O)n1cc(I)c(=O)[nH]c1=O
: