Target
P2Y purinoceptor 14
Ligand
BDBM50303341
Substrate
Meas. Tech.
ChEMBL_595741 (CHEMBL1045264)
EC50
2730±n/a nM
Citation
 Das, AKo, HBurianek, LEBarrett, MOHarden, TKJacobson, KA Human P2Y(14) receptor agonists: truncation of the hexose moiety of uridine-5'-diphosphoglucose and its replacement with alkyl and aryl groups. J Med Chem 53:471-80 (2010)  
Target
Name:
P2Y purinoceptor 14
Synonyms:
GPR105 KIAA0001 P2Y14_HUMAN | Purinergic receptor P2Y14
Type:
PROTEIN
Mol. Mass.:
38991.62
Organism:
Homo sapiens (Human)
Description:
ChEMBL_1502487
Residue:
338
  
Inhibitor
Name:
BDBM50303341
Synonyms:
Diphosphoric Acid 1-beta-Methyl Ester 2-(Uridine-5'-yl)ester, di ammonium Salt
Type:
Small organic molecule
Emp. Form.:
C10H14N2O12P2
Mol. Mass.:
416.173
SMILES:
COP([O-])(=O)OP([O-])(=O)OC[C@H]1O[C@H]([C@H](O)[C@@H]1O)n1ccc(=O)[nH]c1=O
: