Target
P2Y purinoceptor 14
Ligand
BDBM50303337
Substrate
Meas. Tech.
ChEMBL_595741 (CHEMBL1045264)
EC50
1900±n/a nM
Citation
 Das, AKo, HBurianek, LEBarrett, MOHarden, TKJacobson, KA Human P2Y(14) receptor agonists: truncation of the hexose moiety of uridine-5'-diphosphoglucose and its replacement with alkyl and aryl groups. J Med Chem 53:471-80 (2010)  
Target
Name:
P2Y purinoceptor 14
Synonyms:
GPR105 KIAA0001 P2Y14_HUMAN | Purinergic receptor P2Y14
Type:
PROTEIN
Mol. Mass.:
38991.62
Organism:
Homo sapiens (Human)
Description:
ChEMBL_1502487
Residue:
338
  
Inhibitor
Name:
BDBM50303337
Synonyms:
Diphosphoric Acid 1-beta-(4-Methoxyphenyl)Ester 2-(Uridine-5'-yl)ester,di ammonium Salt
Type:
Small organic molecule
Emp. Form.:
C16H18N2O13P2
Mol. Mass.:
508.2683
SMILES:
COc1ccc(OP([O-])(=O)OP([O-])(=O)OC[C@H]2O[C@H]([C@H](O)[C@@H]2O)n2ccc(=O)[nH]c2=O)cc1
: