Target
P2Y purinoceptor 6
Ligand
BDBM50303333
Substrate
Meas. Tech.
ChEMBL_595742 (CHEMBL1045265)
EC50
>10000±n/a nM
Citation
 Das, AKo, HBurianek, LEBarrett, MOHarden, TKJacobson, KA Human P2Y(14) receptor agonists: truncation of the hexose moiety of uridine-5'-diphosphoglucose and its replacement with alkyl and aryl groups. J Med Chem 53:471-80 (2010)  
Target
Name:
P2Y purinoceptor 6
Synonyms:
P2RY6 P2Y purinoceptor 6 Pyrimidinergic receptor P2Y6
Type:
PROTEIN
Mol. Mass.:
36452.29
Organism:
Homo sapiens (Human)
Description:
ChEMBL_1511151
Residue:
328
  
Inhibitor
Name:
BDBM50303333
Synonyms:
Diphosphoric Acid 1-beta-(3-Butynyl)Ester 2-(2-Thiouridine-5'-yl)ester, bis-Triethylammonium Salt
Type:
Small organic molecule
Emp. Form.:
C13H16N2O11P2S
Mol. Mass.:
470.287
SMILES:
O[C@H]1[C@@H](O)[C@@H](O[C@@H]1COP([O-])(=O)OP([O-])(=O)OCCC#C)n1ccc(=O)[nH]c1=S
: