Target
P2Y purinoceptor 6
Ligand
BDBM50303334
Substrate
Meas. Tech.
ChEMBL_595742 (CHEMBL1045265)
EC50
>10000±n/a nM
Citation
 Das, AKo, HBurianek, LEBarrett, MOHarden, TKJacobson, KA Human P2Y(14) receptor agonists: truncation of the hexose moiety of uridine-5'-diphosphoglucose and its replacement with alkyl and aryl groups. J Med Chem 53:471-80 (2010)  
Target
Name:
P2Y purinoceptor 6
Synonyms:
P2RY6 P2Y purinoceptor 6 Pyrimidinergic receptor P2Y6
Type:
PROTEIN
Mol. Mass.:
36452.29
Organism:
Homo sapiens (Human)
Description:
ChEMBL_1511151
Residue:
328
  
Inhibitor
Name:
BDBM50303334
Synonyms:
Diphosphoric Acid 1-r-Glycerol Ester 2-(Uridine-5'-yl)ester,di ammonium Salt
Type:
Small organic molecule
Emp. Form.:
C12H18N2O14P2
Mol. Mass.:
476.2249
SMILES:
OCC(O)COP([O-])(=O)OP([O-])(=O)OC[C@H]1O[C@H]([C@H](O)[C@@H]1O)n1ccc(=O)[nH]c1=O
: