Target
P2Y purinoceptor 6
Ligand
BDBM50303347
Substrate
Meas. Tech.
ChEMBL_595740 (CHEMBL1045263)
EC50
2040±n/a nM
Citation
 Das, AKo, HBurianek, LEBarrett, MOHarden, TKJacobson, KA Human P2Y(14) receptor agonists: truncation of the hexose moiety of uridine-5'-diphosphoglucose and its replacement with alkyl and aryl groups. J Med Chem 53:471-80 (2010)  
Target
Name:
P2Y purinoceptor 6
Synonyms:
P2RY6 P2Y purinoceptor 6 Pyrimidinergic receptor P2Y6
Type:
PROTEIN
Mol. Mass.:
36452.29
Organism:
Homo sapiens (Human)
Description:
ChEMBL_1511151
Residue:
328
  
Inhibitor
Name:
BDBM50303347
Synonyms:
Diphosphoric Acid 1-beta-tert-Butyl Ester 2-(2-Thiouridine-5'-yl)ester, di Ammonium Salt
Type:
Small organic molecule
Emp. Form.:
C13H20N2O11P2S
Mol. Mass.:
474.318
SMILES:
CC(C)(C)OP([O-])(=O)OP([O-])(=O)OC[C@H]1O[C@H]([C@H](O)[C@@H]1O)n1ccc(=O)[nH]c1=S
: