Target
P2Y purinoceptor 14
Ligand
BDBM50209663
Substrate
Meas. Tech.
ChEMBL_595741 (CHEMBL1045264)
EC50
11±n/a nM
Citation
 Das, AKo, HBurianek, LEBarrett, MOHarden, TKJacobson, KA Human P2Y(14) receptor agonists: truncation of the hexose moiety of uridine-5'-diphosphoglucose and its replacement with alkyl and aryl groups. J Med Chem 53:471-80 (2010)  
Target
Name:
P2Y purinoceptor 14
Synonyms:
GPR105 KIAA0001 P2Y14_HUMAN | Purinergic receptor P2Y14
Type:
PROTEIN
Mol. Mass.:
38991.62
Organism:
Homo sapiens (Human)
Description:
ChEMBL_1502487
Residue:
338
  
Inhibitor
Name:
BDBM50209663
Synonyms:
CHEMBL374384 diphosphoric acid 1-alpha-D-glucopyranosyl ester 2-((4'-thio)uridin-5''-yl) ester
Type:
Small organic molecule
Emp. Form.:
C15H24N2O16P2S
Mol. Mass.:
582.367
SMILES:
OC[C@H]1O[C@H](OP(O)(=O)OP(O)(=O)OC[C@H]2O[C@H]([C@H](O)[C@@H]2O)n2ccc(=S)[nH]c2=O)[C@H](O)[C@@H](O)[C@@H]1O
: