Target
Mitogen-activated protein kinase 10
Ligand
BDBM50169959
Substrate
Meas. Tech.
ChEMBL_596610 (CHEMBL1042629)
IC50
120±n/a nM
Citation
 Kamenecka, TJiang, RSong, XDuckett, DChen, WLing, YYHabel, JLaughlin, JDChambers, JFiguera-Losada, MCameron, MDLin, LRuiz, CHLoGrasso, PV Synthesis, biological evaluation, X-ray structure, and pharmacokinetics of aminopyrimidine c-jun-N-terminal kinase (JNK) inhibitors. J Med Chem 53:419-31 (2010)  
Target
Name:
Mitogen-activated protein kinase 10
Synonyms:
JNK3 MAP kinase p49 3F12 MK10_HUMAN Mitogen-activated protein kinase 10 (Stress-activated protein kinase JNK3) (c-Jun N-terminal kinase 3) (MAP kinase p49 3F12) PRKM10 Stress-activated protein kinase JNK3 | c-Jun N-terminal kinase 3 (JNK3)
Type:
Enzyme
Mol. Mass.:
52586.89
Organism:
Homo sapiens (Human)
Description:
Residue:
464
  
Inhibitor
Name:
BDBM50169959
Synonyms:
2-(benzo[d]thiazol-2(3H)-ylidene)-2-(2-(2-(pyridin-3-yl)ethylamino)pyrimidin-4-yl)acetonitrile AS601245 CHEMBL191384 | [3H-Benzothiazol-(2Z)-ylidene]-[2-(2-pyridin-3-yl-ethylamino)-pyrimidin-4-yl]-acetonitrile
Type:
Small organic molecule
Emp. Form.:
C20H16N6S
Mol. Mass.:
372.446
SMILES:
N#CC(c1nc2ccccc2s1)c1ccnc(NCCc2cccnc2)n1
: