Target
5-hydroxytryptamine receptor 7
Ligand
BDBM50304001
Substrate
Meas. Tech.
ChEMBL_595422 (CHEMBL1040063)
Ki
>500±n/a nM
Citation
 de la Fuente, TMartín-Fontecha, MSallander, JBenhamú, BCampillo, MMedina, RAPellissier, LPClaeysen, SDumuis, APardo, LLópez-Rodríguez, ML Benzimidazole derivatives as new serotonin 5-HT6 receptor antagonists. Molecular mechanisms of receptor inactivation. J Med Chem 53:1357-69 (2010)  
Target
Name:
5-hydroxytryptamine receptor 7
Synonyms:
5-HT-7 5-HT7 5-HT7S 5HT7 HTR7 | Serotonin receptor 7
Type:
G Protein-Coupled Receptor (GPCR)
Mol. Mass.:
53573.08
Organism:
Homo sapiens (Human)
Description:
P34969
Residue:
479
  
Inhibitor
Name:
BDBM50304001
Synonyms:
CHEMBL584690 | [4-(4-Methylpiperazin-1-yl)-1H-benzimidazol-2-yl](1-naphthyl)methanone
Type:
Small organic molecule
Emp. Form.:
C23H22N4O
Mol. Mass.:
370.447
SMILES:
CN1CCN(CC1)c1cccc2[nH]c(nc12)C(=O)c1cccc2ccccc12
: