Target
D(1A) dopamine receptor
Ligand
BDBM50304405
Substrate
Meas. Tech.
ChEMBL_603130 (CHEMBL1038852)
Ki
3019±n/a nM
Citation
 Schulze, MMüller, FKMason, JMGörls, HLehmann, JEnzensperger, C Dibenzazecine scaffold rebuilding--is the flexibility always essential for high dopamine receptor affinities? Bioorg Med Chem 17:6898-907 (2009)  
Target
Name:
D(1A) dopamine receptor
Synonyms:
DA D1 receptor DRD1 Dopamine D1 receptor Dopamine D1A
Type:
Enzyme
Mol. Mass.:
49303.43
Organism:
Homo sapiens (Human)
Description:
P21728
Residue:
446
  
Inhibitor
Name:
BDBM50304405
Synonyms:
2-Methyl-1-(2-methylbenzyl)-1,2,3,4-tetrahydroisoquinolin-6-ol | CHEMBL594798
Type:
Small organic molecule
Emp. Form.:
C18H21NO
Mol. Mass.:
267.3654
SMILES:
CN1CCc2cc(O)ccc2C1Cc1ccccc1C
: