Target
D(1A) dopamine receptor
Ligand
BDBM50304407
Substrate
Meas. Tech.
ChEMBL_603130 (CHEMBL1038852)
Ki
2349±n/a nM
Citation
 Schulze, MMüller, FKMason, JMGörls, HLehmann, JEnzensperger, C Dibenzazecine scaffold rebuilding--is the flexibility always essential for high dopamine receptor affinities? Bioorg Med Chem 17:6898-907 (2009)  
Target
Name:
D(1A) dopamine receptor
Synonyms:
DA D1 receptor DRD1 Dopamine D1 receptor Dopamine D1A
Type:
Enzyme
Mol. Mass.:
49303.43
Organism:
Homo sapiens (Human)
Description:
P21728
Residue:
446
  
Inhibitor
Name:
BDBM50304407
Synonyms:
6-Methoxy-2-methyl-1-(2-methylbenzyl)-1,2,3,4-tetrahydroisoquinoline | CHEMBL594127
Type:
Small organic molecule
Emp. Form.:
C19H23NO
Mol. Mass.:
281.392
SMILES:
COc1ccc2C(Cc3ccccc3C)N(C)CCc2c1
: